Reaction Details
Target5-hydroxytryptamine receptor 1A
LigandBDBM21367
Substrate/Competitorn/a
Meas. Tech.ChEMBL_430135 (CHEMBL919613)
Ki 52.7±n/a nM
Citation Leopoldo, MBerardi, FColabufo, NAContino, MLacivita, ENiso, MPerrone, RTortorella, V Structure-affinity relationship study on N-(1,2,3,4-tetrahydronaphthalen-1-yl)-4-aryl-1-piperazinealkylamides, a new class of 5-hydroxytryptamine7 receptor agents. J Med Chem47:6616-24 (2004) 
 
5-hydroxytryptamine receptor 1A
Name:5-hydroxytryptamine receptor 1A
Type:G Protein-Coupled Receptor (GPCR)
Mol. Mass.:46445.29
Organism:Rattus norvegicus (rat)
Description:Binding assays were performed using rat hippocampal membranes.
Residue:422
BDBM21367
NameBDBM21367
Synonyms:6-{4-[2-(methylsulfanyl)phenyl]piperazin-1-yl}-N-(1,2,3,4-tetrahydronaphthalen-1-yl)hexanamide LP-44 | Piperazinehexanamide derivative, 5
TypeSmall organic molecule
Emp. Form.C27H37N3OS
Mol. Mass.451.667
SMILESCSc1ccccc1N1CCN(CCCCCC(=O)NC2CCCc3ccccc23)CC1