Reaction Details
TargetFibroblast growth factor receptor 2
LigandBDBM50587622
Substrate/Competitorn/a
Meas. Tech.ChEMBL_2184176 (CHEMBL5096258)
IC50 0.270000±n/a nM
Citation Yamani, AZd?alik-Bielecka, DLipner, JSta?czak, APiórkowska, NSta?czak, PSOlejkowska, PHucz-Kalitowska, JMagdycz, MDzwonek, KDubiel, KLamparska-Przybysz, MPopiel, DPieczykolan, JWieczorek, M Discovery and optimization of novel pyrazole-benzimidazole CPL304110, as a potent and selective inhibitor of fibroblast growth factor receptors FGFR (1-3). Eur J Med Chem210:0 (2021) 
 
Fibroblast growth factor receptor 2
Name:Fibroblast growth factor receptor 2
Type:Enzyme
Mol. Mass.:92015.45
Organism:Homo sapiens (Human)
Description:P21802
Residue:821
BDBM50587622
NameBDBM50587622
Synonyms:CHEMBL5171314
TypeSmall organic molecule
Emp. Form.C24H26FN5O3
Mol. Mass.451.4933
SMILESCOc1cc(CCc2cc(n[nH]2)-c2nc3cc(F)c(cc3[nH]2)N2CCOCC2)cc(OC)c1