Reaction Details
TargetFibroblast growth factor receptor 2
LigandBDBM50587620
Substrate/Competitorn/a
Meas. Tech.ChEMBL_2184176 (CHEMBL5096258)
IC50 0.437000±n/a nM
Citation Yamani, AZd?alik-Bielecka, DLipner, JSta?czak, APiórkowska, NSta?czak, PSOlejkowska, PHucz-Kalitowska, JMagdycz, MDzwonek, KDubiel, KLamparska-Przybysz, MPopiel, DPieczykolan, JWieczorek, M Discovery and optimization of novel pyrazole-benzimidazole CPL304110, as a potent and selective inhibitor of fibroblast growth factor receptors FGFR (1-3). Eur J Med Chem210:0 (2021) 
 
Fibroblast growth factor receptor 2
Name:Fibroblast growth factor receptor 2
Type:Enzyme
Mol. Mass.:92015.45
Organism:Homo sapiens (Human)
Description:P21802
Residue:821
BDBM50587620
NameBDBM50587620
Synonyms:CHEMBL5189958
TypeSmall organic molecule
Emp. Form.C25H29FN6O2
Mol. Mass.464.5352
SMILESCOc1cc(CCc2cc(n[nH]2)-c2nc3cc(F)c(cc3[nH]2)N2CCN(C)CC2)cc(OC)c1