Reaction Details
TargetFibroblast growth factor receptor 2
LigandBDBM50587619
Substrate/Competitorn/a
Meas. Tech.ChEMBL_2184176 (CHEMBL5096258)
IC50 0.430000±n/a nM
Citation Yamani, AZd?alik-Bielecka, DLipner, JSta?czak, APiórkowska, NSta?czak, PSOlejkowska, PHucz-Kalitowska, JMagdycz, MDzwonek, KDubiel, KLamparska-Przybysz, MPopiel, DPieczykolan, JWieczorek, M Discovery and optimization of novel pyrazole-benzimidazole CPL304110, as a potent and selective inhibitor of fibroblast growth factor receptors FGFR (1-3). Eur J Med Chem210:0 (2021) 
 
Fibroblast growth factor receptor 2
Name:Fibroblast growth factor receptor 2
Type:Enzyme
Mol. Mass.:92015.45
Organism:Homo sapiens (Human)
Description:P21802
Residue:821
BDBM50587619
NameBDBM50587619
Synonyms:CHEMBL5205436
TypeSmall organic molecule
Emp. Form.C25H28Cl2N6O2
Mol. Mass.515.435
SMILESCOc1cc(OC)c(Cl)c(CCc2cc(n[nH]2)-c2nc3ccc(cc3[nH]2)N2CCN(C)CC2)c1Cl