Reaction Details
Target5-hydroxytryptamine receptor 2C
LigandBDBM50158032
Substrate/Competitorn/a
Meas. Tech.ChEMBL_303338 (CHEMBL840154)
Ki 383±n/a nM
Citation Cole, DCEllingboe, JWLennox, WJMazandarani, HSmith, DLStock, JRZhang, GZhou, PSchechter, LE N1-arylsulfonyl-3-(1,2,3,6-tetrahydropyridin-4-yl)-1H-indole derivatives are potent and selective 5-HT6 receptor antagonists. Bioorg Med Chem Lett15:379-83 (2004) 
 
5-hydroxytryptamine receptor 2C
Name:5-hydroxytryptamine receptor 2C
Type:G Protein-Coupled Receptor (GPCR)
Mol. Mass.:51836.79
Organism:Homo sapiens (Human)
Description:P28335
Residue:458
BDBM50158032
NameBDBM50158032
Synonyms:1-(2-Chloro-benzenesulfonyl)-3-(1,2,3,6-tetrahydro-pyridin-4-yl)-1H-indole | CHEMBL362487
TypeSmall organic molecule
Emp. Form.C19H17ClN2O2S
Mol. Mass.372.868
SMILESClc1ccccc1S(=O)(=O)n1cc(C2=CCNCC2)c2ccccc12