Reaction Details
Target5-hydroxytryptamine receptor 6
LigandBDBM50158039
Substrate/Competitorn/a
Meas. Tech.ChEMBL_303182 (CHEMBL829676)
Ki 3±n/a nM
Citation Cole, DCEllingboe, JWLennox, WJMazandarani, HSmith, DLStock, JRZhang, GZhou, PSchechter, LE N1-arylsulfonyl-3-(1,2,3,6-tetrahydropyridin-4-yl)-1H-indole derivatives are potent and selective 5-HT6 receptor antagonists. Bioorg Med Chem Lett15:379-83 (2004) 
 
5-hydroxytryptamine receptor 6
Name:5-hydroxytryptamine receptor 6
Type:G Protein-Coupled Receptor (GPCR)
Mol. Mass.:46968.43
Organism:Homo sapiens (Human)
Description:P50406
Residue:440
BDBM50158039
NameBDBM50158039
Synonyms:4-(6-Chloro-3-piperidin-4-yl-indole-1-sulfonyl)-phenylamine | CHEMBL178870
TypeSmall organic molecule
Emp. Form.C19H20ClN3O2S
Mol. Mass.389.899
SMILESNc1ccc(cc1)S(=O)(=O)n1cc(C2CCNCC2)c2ccc(Cl)cc12