Reaction Details
TargetAndrogen receptor
LigandBDBM50158067
Substrate/Competitorn/a
Meas. Tech.ChEMBL_303055 (CHEMBL828881)
Ki 2±n/a nM
Citation Salvati, MEBalog, AWei, DDPickering, DAttar, RMGeng, JRizzo, CAHunt, JTGottardis, MMWeinmann, RMartinez, R Identification of a novel class of androgen receptor antagonists based on the bicyclic-1H-isoindole-1,3(2H)-dione nucleus. Bioorg Med Chem Lett15:389-93 (2004) 
 
Androgen receptor
Name:Androgen receptor
Type:Receptor
Mol. Mass.:99185.27
Organism:Homo sapiens (Human)
Description:CHO cells were stably transfected with human AR gene.
Residue:920
BDBM50158067
NameBDBM50158067
Synonyms:(2S,6R)-4-(3-Chloro-4-fluoro-phenyl)-4-aza-tricyclo[5.2.1.0*2,6*]dec-8-ene-3,5-dione | CHEMBL180859
TypeSmall organic molecule
Emp. Form.C15H11ClFNO2
Mol. Mass.291.705
SMILESOc1c2C3CC(C=C3)c2c(O)n1-c1ccc(F)c(Cl)c1