Reaction Details
TargetAndrogen receptor
LigandBDBM50158070
Substrate/Competitorn/a
Meas. Tech.ChEMBL_303028 (CHEMBL830415)
Ki 158±n/a nM
Citation Salvati, MEBalog, AWei, DDPickering, DAttar, RMGeng, JRizzo, CAHunt, JTGottardis, MMWeinmann, RMartinez, R Identification of a novel class of androgen receptor antagonists based on the bicyclic-1H-isoindole-1,3(2H)-dione nucleus. Bioorg Med Chem Lett15:389-93 (2004) 
 
Androgen receptor
Name:Androgen receptor
Type:Receptor
Mol. Mass.:99185.27
Organism:Homo sapiens (Human)
Description:CHO cells were stably transfected with human AR gene.
Residue:920
BDBM50158070
NameBDBM50158070
Synonyms:(2S,6R)-4-(3,5-Dichloro-phenyl)-4-aza-tricyclo[5.2.1.0*2,6*]dec-8-ene-3,5-dione | CHEMBL178886
TypeSmall organic molecule
Emp. Form.C15H11Cl2NO2
Mol. Mass.308.159
SMILESOc1c2C3CC(C=C3)c2c(O)n1-c1cc(Cl)cc(Cl)c1