Reaction Details
TargetAndrogen receptor
LigandBDBM50158072
Substrate/Competitorn/a
Meas. Tech.ChEMBL_312710 (CHEMBL837993)
IC50 10±n/a nM
Citation Salvati, MEBalog, AWei, DDPickering, DAttar, RMGeng, JRizzo, CAHunt, JTGottardis, MMWeinmann, RMartinez, R Identification of a novel class of androgen receptor antagonists based on the bicyclic-1H-isoindole-1,3(2H)-dione nucleus. Bioorg Med Chem Lett15:389-93 (2004) 
 
Androgen receptor
Name:Androgen receptor
Type:Receptor
Mol. Mass.:99185.27
Organism:Homo sapiens (Human)
Description:CHO cells were stably transfected with human AR gene.
Residue:920
BDBM50158072
NameBDBM50158072
Synonyms:(2S,6R)-4-(3,4-Dimethyl-phenyl)-4-aza-tricyclo[5.2.1.0*2,6*]dec-8-ene-3,5-dione | CHEMBL366924
TypeSmall organic molecule
Emp. Form.C17H17NO2
Mol. Mass.267.3224
SMILESCc1ccc(cc1C)-n1c(O)c2C3CC(C=C3)c2c1O