Reaction Details
TargetCorticotropin-releasing factor receptor 1
LigandBDBM50158123
Substrate/Competitorn/a
Meas. Tech.ChEMBL_303554 (CHEMBL828954)
Ki 6.1±n/a nM
Citation Zuev, DMichne, JAPin, SSZhang, JTaber, MTDubowchik, GM Optimization of CRF1R binding affinity of 2-(2,4,6-trichlorophenyl)-4-trifluoromethyl-5-aminomethylthiazoles through rapid and selective parallel synthesis. Bioorg Med Chem Lett15:431-4 (2004) 
 
Corticotropin-releasing factor receptor 1
Name:Corticotropin-releasing factor receptor 1
Type:Enzyme
Mol. Mass.:50744.31
Organism:Homo sapiens (Human)
Description:P34998
Residue:444
BDBM50158123
NameBDBM50158123
Synonyms:(5-{[Benzyl-(3,3,3-trifluoro-propyl)-amino]-methyl}-4-trifluoromethyl-thiazol-2-yl)-(2,4,6-trichloro-phenyl)-amine | CHEMBL441311
TypeSmall organic molecule
Emp. Form.C21H16Cl3F6N3S
Mol. Mass.562.786
SMILESFC(F)(F)CCN(Cc1sc(Nc2c(Cl)cc(Cl)cc2Cl)nc1C(F)(F)F)Cc1ccccc1