Reaction Details
TargetCorticotropin-releasing factor receptor 1
LigandBDBM50158134
Substrate/Competitorn/a
Meas. Tech.ChEMBL_303554 (CHEMBL828954)
Ki 4.8±n/a nM
Citation Zuev, DMichne, JAPin, SSZhang, JTaber, MTDubowchik, GM Optimization of CRF1R binding affinity of 2-(2,4,6-trichlorophenyl)-4-trifluoromethyl-5-aminomethylthiazoles through rapid and selective parallel synthesis. Bioorg Med Chem Lett15:431-4 (2004) 
 
Corticotropin-releasing factor receptor 1
Name:Corticotropin-releasing factor receptor 1
Type:Enzyme
Mol. Mass.:50744.31
Organism:Homo sapiens (Human)
Description:P34998
Residue:444
BDBM50158134
NameBDBM50158134
Synonyms:(5-{[(4-Fluoro-benzyl)-(3,3,3-trifluoro-propyl)-amino]-methyl}-4-trifluoromethyl-thiazol-2-yl)-(2,4,6-trichloro-phenyl)-amine | CHEMBL362448
TypeSmall organic molecule
Emp. Form.C21H15Cl3F7N3S
Mol. Mass.580.777
SMILESFc1ccc(CN(CCC(F)(F)F)Cc2sc(Nc3c(Cl)cc(Cl)cc3Cl)nc2C(F)(F)F)cc1