Reaction Details
TargetCytochrome P450 26A1
LigandBDBM50158411
Substrate/Competitorn/a
Meas. Tech.ChEMBL_430393 (CHEMBL916377)
IC50 56±n/a nM
Citation Patel, JBHuynh, CKHandratta, VDGediya, LKBrodie, AMGoloubeva, OGClement, OONanne, IPSoprano, DRNjar, VC Novel retinoic acid metabolism blocking agents endowed with multiple biological activities are efficient growth inhibitors of human breast and prostate cancer cells in vitro and a human breast tumor xenograft in nude mice. J Med Chem47:6716-29 (2004) 
 
Cytochrome P450 26A1
Name:Cytochrome P450 26A1
Type:Enzyme
Mol. Mass.:56216.16
Organism:Homo sapiens (Human)
Description:O43174
Residue:497
BDBM50158411
NameBDBM50158411
Synonyms:(2E,4E,6E,8E)-9-(3-Imidazol-1-yl-2,6,6-trimethyl-cyclohex-1-enyl)-3,7-dimethyl-nona-2,4,6,8-tetraenoic acid (4-hydroxy-phenyl)-amide 9-(3-(1H-imidazol-1-yl)-2,6,6-trimethylcyclohex-1-enyl)-N-(4-hydroxyphenyl)-3,7-dimethylnona-2,4,6,8-tetraenamide | CHEMBL190837
TypeSmall organic molecule
Emp. Form.C29H35N3O2
Mol. Mass.457.6071
SMILESC\C(\C=C\C1=C(C)C(CCC1(C)C)n1ccnc1)=C/C=C/C(/C)=C/C(=O)Nc1ccc(O)cc1