Reaction Details
TargetRetinoic acid receptor beta
LigandBDBM50091700
Substrate/Competitorn/a
Meas. Tech.ChEMBL_430405 (CHEMBL916389)
IC50 1000000±n/a nM
Citation Patel, JBHuynh, CKHandratta, VDGediya, LKBrodie, AMGoloubeva, OGClement, OONanne, IPSoprano, DRNjar, VC Novel retinoic acid metabolism blocking agents endowed with multiple biological activities are efficient growth inhibitors of human breast and prostate cancer cells in vitro and a human breast tumor xenograft in nude mice. J Med Chem47:6716-29 (2004) 
 
Retinoic acid receptor beta
Name:Retinoic acid receptor beta
Type:PROTEIN
Mol. Mass.:50498.70
Organism:Homo sapiens (Human)
Description:ChEMBL_1458015
Residue:455
BDBM50091700
NameBDBM50091700
Synonyms:(2E,4E,6E,8E)-3,7-Dimethyl-9-(2,6,6-trimethyl-3-[1,2,4]triazol-1-yl-cyclohex-1-enyl)-nona-2,4,6,8-tetraenoic acid CHEMBL417769
TypeSmall organic molecule
Emp. Form.C22H29N3O2
Mol. Mass.367.4846
SMILESC\C(\C=C\C1=C(C)C(CCC1(C)C)n1cncn1)=C/C=C/C(/C)=C/C(O)=O