Reaction Details
TargetCytochrome P450 26A1
LigandBDBM50158410
Substrate/Competitorn/a
Meas. Tech.ChEMBL_430395 (CHEMBL916379)
IC50 5.2±n/a nM
Citation Patel, JBHuynh, CKHandratta, VDGediya, LKBrodie, AMGoloubeva, OGClement, OONanne, IPSoprano, DRNjar, VC Novel retinoic acid metabolism blocking agents endowed with multiple biological activities are efficient growth inhibitors of human breast and prostate cancer cells in vitro and a human breast tumor xenograft in nude mice. J Med Chem47:6716-29 (2004) 
 
Cytochrome P450 26A1
Name:Cytochrome P450 26A1
Type:Enzyme
Mol. Mass.:56216.16
Organism:Homo sapiens (Human)
Description:O43174
Residue:497
BDBM50158410
NameBDBM50158410
Synonyms:4-((+/-)-(1H-imidazol-1-yl)-N-(imidazolyl)-(E)-retinamide | CHEMBL223072
TypeSmall organic molecule
Emp. Form.C26H32N4O
Mol. Mass.416.5585
SMILESC\C(\C=C\C1=C(C)C(CCC1(C)C)n1ccnc1)=C/C=C/C(/C)=C/C(=O)n1ccnc1