Reaction Details
TargetRetinoic acid receptor beta
LigandBDBM50158416
Substrate/Competitorn/a
Meas. Tech.ChEMBL_430405 (CHEMBL916389)
IC50 175000±n/a nM
Citation Patel, JBHuynh, CKHandratta, VDGediya, LKBrodie, AMGoloubeva, OGClement, OONanne, IPSoprano, DRNjar, VC Novel retinoic acid metabolism blocking agents endowed with multiple biological activities are efficient growth inhibitors of human breast and prostate cancer cells in vitro and a human breast tumor xenograft in nude mice. J Med Chem47:6716-29 (2004) 
 
Retinoic acid receptor beta
Name:Retinoic acid receptor beta
Type:PROTEIN
Mol. Mass.:50498.70
Organism:Homo sapiens (Human)
Description:ChEMBL_1458015
Residue:455
BDBM50158416
NameBDBM50158416
Synonyms:4-((+/-)-(1H-imidazol-1-yl)-(13Z)-retinoic acid | CHEMBL387639
TypeSmall organic molecule
Emp. Form.C23H30N2O2
Mol. Mass.366.4965
SMILESC\C(\C=C\C1=C(C)C(CCC1(C)C)n1ccnc1)=C/C=C/C(/C)=C\C(O)=O