Reaction Details
TargetCytochrome P450 26A1
LigandBDBM50158415
Substrate/Competitorn/a
Meas. Tech.ChEMBL_430394 (CHEMBL916378)
IC50 215±n/a nM
Citation Patel, JBHuynh, CKHandratta, VDGediya, LKBrodie, AMGoloubeva, OGClement, OONanne, IPSoprano, DRNjar, VC Novel retinoic acid metabolism blocking agents endowed with multiple biological activities are efficient growth inhibitors of human breast and prostate cancer cells in vitro and a human breast tumor xenograft in nude mice. J Med Chem47:6716-29 (2004) 
 
Cytochrome P450 26A1
Name:Cytochrome P450 26A1
Type:Enzyme
Mol. Mass.:56216.16
Organism:Homo sapiens (Human)
Description:O43174
Residue:497
BDBM50158415
NameBDBM50158415
Synonyms:4-((+/-)-(1H-imidazol-1-yl)-(E)-methylretinoate | CHEMBL224828
TypeSmall organic molecule
Emp. Form.C24H32N2O2
Mol. Mass.380.5231
SMILESCOC(=O)\C=C(/C)\C=C\C=C(/C)\C=C\C1=C(C)C(CCC1(C)C)n1ccnc1