Reaction Details
TargetCytochrome P450 2C19
LigandBDBM50158470
Substrate/Competitorn/a
Meas. Tech.ChEMBL_430467 (CHEMBL916311)
Ki 300±n/a nM
Citation Locuson, CWSuzuki, HRettie, AEJones, JP Charge and substituent effects on affinity and metabolism of benzbromarone-based CYP2C19 inhibitors. J Med Chem47:6768-76 (2004) 
 
Cytochrome P450 2C19
Name:Cytochrome P450 2C19
Type:Enzyme
Mol. Mass.:55935.47
Organism:Homo sapiens (Human)
Description:P33261
Residue:490
BDBM50158470
NameBDBM50158470
Synonyms:2,6-dibromo-4-((2-ethylbenzofuran-3-yl)(hydroxy)methyl)phenol | CHEMBL224079
TypeSmall organic molecule
Emp. Form.C17H14Br2O3
Mol. Mass.426.099
SMILESCCc1oc2ccccc2c1C(O)c1cc(Br)c(O)c(Br)c1