Reaction Details
TargetMelanin-concentrating hormone receptor 1
LigandBDBM50152456
Substrate/Competitorn/a
Meas. Tech.ChEMBL_430510 (CHEMBL917759)
Ki 2±n/a nM
Citation Lavrador, KMurphy, BSaunders, JStruthers, SWang, XWilliams, J A screening library for peptide activated G-protein coupled receptors. 1. The test set. J Med Chem47:6864-74 (2004) 
 
Melanin-concentrating hormone receptor 1
Name:Melanin-concentrating hormone receptor 1
Type:Enzyme Catalytic Domain
Mol. Mass.:39075.64
Organism:RAT
Description:Melanin Concentrating Hormone 1 GPR24 RAT::P97639
Residue:353
BDBM50152456
NameBDBM50152456
Synonyms:(S)-3-{3-[4-(3-Acetylamino-phenyl)-piperidin-1-yl]-propylcarbamoyl}-4-(3,4-difluoro-phenyl)-6-methoxymethyl-2-oxo-1,2,3,4-tetrahydro-pyrimidine-5-carboxylic acid methyl ester CHEMBL185271
TypeSmall organic molecule
Emp. Form.C31H37F2N5O6
Mol. Mass.613.6522
SMILESCOCC1=C([C@@H](N(C(=O)NCCCN2CCC(CC2)c2cccc(NC(C)=O)c2)C(=O)N1)c1ccc(F)c(F)c1)C(=O)OC