Reaction Details
TargetNeuromedin-B receptor
LigandBDBM50158702
Substrate/Competitorn/a
Meas. Tech.ChEMBL_306025 (CHEMBL829951)
IC50 0.96±n/a nM
Citation Nock, BANikolopoulou, AGalanis, ACordopatis, PWaser, BReubi, JCMaina, T Potent bombesin-like peptides for GRP-receptor targeting of tumors with 99mTc: a preclinical study. J Med Chem48:100-10 (2005) 
 
Neuromedin-B receptor
Name:Neuromedin-B receptor
Type:Enzyme Catalytic Domain
Mol. Mass.:43447.11
Organism:Homo sapiens (Human)
Description:Bombesin 1 NMBR 0::P28336
Residue:390
BDBM50158702
NameBDBM50158702
Synonyms:CHEMBL413893 | Universal ligand
TypeSmall organic molecule
Emp. Form.C57H76N14O11
Mol. Mass.1133.3005
SMILESCCCC[C@H](NC(=O)[C@H](Cc1ccccc1)NC(=O)[C@H](Cc1cnc[nH]1)NC(=O)[C@H](C)NC(=O)[C@@H](NC(=O)[C@H](C)NC(=O)[C@H](Cc1c[nH]c2ccccc12)NC(=O)[C@H](CCC(N)=O)NC(=O)[C@@H](N)Cc1ccc(O)cc1)C(C)C)C(N)=O