Reaction Details
TargetReverse transcriptase/RNaseH
LigandBDBM50158716
Substrate/Competitorn/a
Meas. Tech.ChEMBL_306176 (CHEMBL830970)
IC50>100000±n/a nM
Citation Dayam, RSanchez, TClement, OShoemaker, RSei, SNeamati, N Beta-diketo acid pharmacophore hypothesis. 1. Discovery of a novel class of HIV-1 integrase inhibitors. J Med Chem48:111-20 (2005) 
 
Reverse transcriptase/RNaseH
Name:Reverse transcriptase/RNaseH
Type:PROTEIN
Mol. Mass.:65229.15
Organism:Human immunodeficiency virus 1
Description:ChEMBL_1473730
Residue:566
BDBM50158716
NameBDBM50158716
Synonyms:4-(3-{5-[1-(3,4-Dimethoxy-phenyl)-meth-(Z)-ylidene]-4-oxo-2-thioxo-thiazolidin-3-yl}-propionyl)-piperazine-1-carboxylic acid ethyl ester | CHEMBL368303
TypeSmall organic molecule
Emp. Form.C22H27N3O6S2
Mol. Mass.493.596
SMILESCCOC(=O)N1CCN(CC1)C(=O)CCN1C(=S)S\C(=C/c2ccc(OC)c(OC)c2)C1=O