Reaction Details
TargetReverse transcriptase/RNaseH
LigandBDBM50158705
Substrate/Competitorn/a
Meas. Tech.ChEMBL_306221 (CHEMBL831129)
IC50 35000±n/a nM
Citation Dayam, RSanchez, TClement, OShoemaker, RSei, SNeamati, N Beta-diketo acid pharmacophore hypothesis. 1. Discovery of a novel class of HIV-1 integrase inhibitors. J Med Chem48:111-20 (2005) 
 
Reverse transcriptase/RNaseH
Name:Reverse transcriptase/RNaseH
Type:PROTEIN
Mol. Mass.:65229.15
Organism:Human immunodeficiency virus 1
Description:ChEMBL_1473730
Residue:566
BDBM50158705
NameBDBM50158705
Synonyms:2-Hydroxy-5-(4-{4-oxo-5-[1-thiophen-2-yl-meth-(Z)-ylidene]-2-thioxo-thiazolidin-3-yl}-butyrylamino)-benzoic acid | CHEMBL179642
TypeSmall organic molecule
Emp. Form.C19H16N2O5S3
Mol. Mass.448.536
SMILESOC(=O)c1cc(NC(=O)CCCN2C(=S)S\C(=C\c3cccs3)C2=O)ccc1O