Reaction Details
TargetReverse transcriptase/RNaseH
LigandBDBM50158742
Substrate/Competitorn/a
Meas. Tech.ChEMBL_306176 (CHEMBL830970)
IC50>100000±n/a nM
Citation Dayam, RSanchez, TClement, OShoemaker, RSei, SNeamati, N Beta-diketo acid pharmacophore hypothesis. 1. Discovery of a novel class of HIV-1 integrase inhibitors. J Med Chem48:111-20 (2005) 
 
Reverse transcriptase/RNaseH
Name:Reverse transcriptase/RNaseH
Type:PROTEIN
Mol. Mass.:65229.15
Organism:Human immunodeficiency virus 1
Description:ChEMBL_1473730
Residue:566
BDBM50158742
NameBDBM50158742
Synonyms:3-{5-[1-(3,4-Dimethoxy-phenyl)-meth-(Z)-ylidene]-4-oxo-2-thioxo-thiazolidin-3-yl}-N-(3-hydroxy-phenyl)-propionamide | CHEMBL366814
TypeSmall organic molecule
Emp. Form.C21H20N2O5S2
Mol. Mass.444.524
SMILESCOc1ccc(\C=C2/SC(=S)N(CCC(=O)Nc3cccc(O)c3)C2=O)cc1OC