Reaction Details
TargetReverse transcriptase/RNaseH
LigandBDBM50158728
Substrate/Competitorn/a
Meas. Tech.ChEMBL_306221 (CHEMBL831129)
IC50>100000±n/a nM
Citation Dayam, RSanchez, TClement, OShoemaker, RSei, SNeamati, N Beta-diketo acid pharmacophore hypothesis. 1. Discovery of a novel class of HIV-1 integrase inhibitors. J Med Chem48:111-20 (2005) 
 
Reverse transcriptase/RNaseH
Name:Reverse transcriptase/RNaseH
Type:PROTEIN
Mol. Mass.:65229.15
Organism:Human immunodeficiency virus 1
Description:ChEMBL_1473730
Residue:566
BDBM50158728
NameBDBM50158728
Synonyms:3-(2-{5-[1-(4-Ethyl-phenyl)-meth-(Z)-ylidene]-4-oxo-2-thioxo-thiazolidin-3-yl}-acetylamino)-benzoic acid | CHEMBL369010
TypeSmall organic molecule
Emp. Form.C21H18N2O4S2
Mol. Mass.426.509
SMILESCCc1ccc(\C=C2\SC(=S)N(CC(=O)Nc3cccc(c3)C(O)=O)C2=O)cc1