Reaction Details
TargetReverse transcriptase/RNaseH
LigandBDBM50158718
Substrate/Competitorn/a
Meas. Tech.ChEMBL_306176 (CHEMBL830970)
IC50 100000±n/a nM
Citation Dayam, RSanchez, TClement, OShoemaker, RSei, SNeamati, N Beta-diketo acid pharmacophore hypothesis. 1. Discovery of a novel class of HIV-1 integrase inhibitors. J Med Chem48:111-20 (2005) 
 
Reverse transcriptase/RNaseH
Name:Reverse transcriptase/RNaseH
Type:PROTEIN
Mol. Mass.:65229.15
Organism:Human immunodeficiency virus 1
Description:ChEMBL_1473730
Residue:566
BDBM50158718
NameBDBM50158718
Synonyms:3-(3-{4-Oxo-2-thioxo-5-[1-p-tolyl-meth-(Z)-ylidene]-thiazolidin-3-yl}-propionylamino)-benzoic acid | CHEMBL179356
TypeSmall organic molecule
Emp. Form.C21H18N2O4S2
Mol. Mass.426.509
SMILESCc1ccc(\C=C2/SC(=S)N(CCC(=O)Nc3cccc(c3)C(O)=O)C2=O)cc1