Reaction Details
TargetReverse transcriptase/RNaseH
LigandBDBM50158745
Substrate/Competitorn/a
Meas. Tech.ChEMBL_306221 (CHEMBL831129)
IC50 17000±n/a nM
Citation Dayam, RSanchez, TClement, OShoemaker, RSei, SNeamati, N Beta-diketo acid pharmacophore hypothesis. 1. Discovery of a novel class of HIV-1 integrase inhibitors. J Med Chem48:111-20 (2005) 
 
Reverse transcriptase/RNaseH
Name:Reverse transcriptase/RNaseH
Type:PROTEIN
Mol. Mass.:65229.15
Organism:Human immunodeficiency virus 1
Description:ChEMBL_1473730
Residue:566
BDBM50158745
NameBDBM50158745
Synonyms:5-(3-{5-[1-Benzo[1,3]dioxol-5-yl-meth-(Z)-ylidene]-4-oxo-2-thioxo-thiazolidin-3-yl}-propionylamino)-2-hydroxy-benzoic acid | CHEMBL175955
TypeSmall organic molecule
Emp. Form.C21H16N2O7S2
Mol. Mass.472.491
SMILESOC(=O)c1cc(NC(=O)CCN2C(=S)S\C(=C/c3ccc4OCOc4c3)C2=O)ccc1O