Reaction Details
TargetReverse transcriptase/RNaseH
LigandBDBM50158752
Substrate/Competitorn/a
Meas. Tech.ChEMBL_306176 (CHEMBL830970)
IC50 20000±n/a nM
Citation Dayam, RSanchez, TClement, OShoemaker, RSei, SNeamati, N Beta-diketo acid pharmacophore hypothesis. 1. Discovery of a novel class of HIV-1 integrase inhibitors. J Med Chem48:111-20 (2005) 
 
Reverse transcriptase/RNaseH
Name:Reverse transcriptase/RNaseH
Type:PROTEIN
Mol. Mass.:65229.15
Organism:Human immunodeficiency virus 1
Description:ChEMBL_1473730
Residue:566
BDBM50158752
NameBDBM50158752
Synonyms:2-{5-[1-(2-Chloro-phenyl)-meth-(Z)-ylidene]-4-oxo-2-thioxo-thiazolidin-3-yl}-N-(2-hydroxy-5-nitro-phenyl)-acetamide | CHEMBL176083
TypeSmall organic molecule
Emp. Form.C18H12ClN3O5S2
Mol. Mass.449.888
SMILESOc1ccc(cc1NC(=O)CN1C(=S)S\C(=C/c2ccccc2Cl)C1=O)[N+]([O-])=O