Reaction Details
TargetReverse transcriptase/RNaseH
LigandBDBM50158722
Substrate/Competitorn/a
Meas. Tech.ChEMBL_306176 (CHEMBL830970)
IC50>100000±n/a nM
Citation Dayam, RSanchez, TClement, OShoemaker, RSei, SNeamati, N Beta-diketo acid pharmacophore hypothesis. 1. Discovery of a novel class of HIV-1 integrase inhibitors. J Med Chem48:111-20 (2005) 
 
Reverse transcriptase/RNaseH
Name:Reverse transcriptase/RNaseH
Type:PROTEIN
Mol. Mass.:65229.15
Organism:Human immunodeficiency virus 1
Description:ChEMBL_1473730
Residue:566
BDBM50158722
NameBDBM50158722
Synonyms:3-(2-{5-[1-(3-Methoxy-phenyl)-meth-(Z)-ylidene]-4-oxo-2-thioxo-thiazolidin-3-yl}-acetylamino)-benzoic acid | CHEMBL175480
TypeSmall organic molecule
Emp. Form.C20H16N2O5S2
Mol. Mass.428.481
SMILESCOc1cccc(\C=C2\SC(=S)N(CC(=O)Nc3cccc(c3)C(O)=O)C2=O)c1