Reaction Details
TargetReverse transcriptase/RNaseH
LigandBDBM50158727
Substrate/Competitorn/a
Meas. Tech.ChEMBL_306221 (CHEMBL831129)
IC50>100000±n/a nM
Citation Dayam, RSanchez, TClement, OShoemaker, RSei, SNeamati, N Beta-diketo acid pharmacophore hypothesis. 1. Discovery of a novel class of HIV-1 integrase inhibitors. J Med Chem48:111-20 (2005) 
 
Reverse transcriptase/RNaseH
Name:Reverse transcriptase/RNaseH
Type:PROTEIN
Mol. Mass.:65229.15
Organism:Human immunodeficiency virus 1
Description:ChEMBL_1473730
Residue:566
BDBM50158727
NameBDBM50158727
Synonyms:3-(3-{4-Oxo-5-[1-thiophen-2-yl-meth-(Z)-ylidene]-2-thioxo-thiazolidin-3-yl}-propionylamino)-benzoic acid | CHEMBL175822
TypeSmall organic molecule
Emp. Form.C18H14N2O4S3
Mol. Mass.418.51
SMILESOC(=O)c1cccc(NC(=O)CCN2C(=S)S\C(=C/c3cccs3)C2=O)c1