Reaction Details
TargetReverse transcriptase/RNaseH
LigandBDBM50158732
Substrate/Competitorn/a
Meas. Tech.ChEMBL_306176 (CHEMBL830970)
IC50 16000±n/a nM
Citation Dayam, RSanchez, TClement, OShoemaker, RSei, SNeamati, N Beta-diketo acid pharmacophore hypothesis. 1. Discovery of a novel class of HIV-1 integrase inhibitors. J Med Chem48:111-20 (2005) 
 
Reverse transcriptase/RNaseH
Name:Reverse transcriptase/RNaseH
Type:PROTEIN
Mol. Mass.:65229.15
Organism:Human immunodeficiency virus 1
Description:ChEMBL_1473730
Residue:566
BDBM50158732
NameBDBM50158732
Synonyms:5-{5-[(E)-2-Cyano-2-(5-methyl-1H-benzoimidazol-2-yl)-vinyl]-furan-2-yl}-2-hydroxy-benzoic acid | CHEMBL175880
TypeSmall organic molecule
Emp. Form.C22H15N3O4
Mol. Mass.385.3722
SMILESCc1ccc2nc([nH]c2c1)C(=Cc1ccc(o1)-c1ccc(O)c(c1)C(O)=O)C#N