Reaction Details
TargetReverse transcriptase/RNaseH
LigandBDBM50158725
Substrate/Competitorn/a
Meas. Tech.ChEMBL_306176 (CHEMBL830970)
IC50>100000±n/a nM
Citation Dayam, RSanchez, TClement, OShoemaker, RSei, SNeamati, N Beta-diketo acid pharmacophore hypothesis. 1. Discovery of a novel class of HIV-1 integrase inhibitors. J Med Chem48:111-20 (2005) 
 
Reverse transcriptase/RNaseH
Name:Reverse transcriptase/RNaseH
Type:PROTEIN
Mol. Mass.:65229.15
Organism:Human immunodeficiency virus 1
Description:ChEMBL_1473730
Residue:566
BDBM50158725
NameBDBM50158725
Synonyms:3-{5-[1-(2-Chloro-phenyl)-meth-(Z)-ylidene]-4-oxo-2-thioxo-thiazolidin-3-yl}-N-(4-nitro-phenyl)-propionamide | CHEMBL176129
TypeSmall organic molecule
Emp. Form.C19H14ClN3O4S2
Mol. Mass.447.915
SMILES[O-][N+](=O)c1ccc(NC(=O)CCN2C(=S)S\C(=C/c3ccccc3Cl)C2=O)cc1