Reaction Details
TargetReverse transcriptase/RNaseH
LigandBDBM50158714
Substrate/Competitorn/a
Meas. Tech.ChEMBL_306221 (CHEMBL831129)
IC50 44000±n/a nM
Citation Dayam, RSanchez, TClement, OShoemaker, RSei, SNeamati, N Beta-diketo acid pharmacophore hypothesis. 1. Discovery of a novel class of HIV-1 integrase inhibitors. J Med Chem48:111-20 (2005) 
 
Reverse transcriptase/RNaseH
Name:Reverse transcriptase/RNaseH
Type:PROTEIN
Mol. Mass.:65229.15
Organism:Human immunodeficiency virus 1
Description:ChEMBL_1473730
Residue:566
BDBM50158714
NameBDBM50158714
Synonyms:5-[5-(4-Carboxy-benzenesulfonyl)-1,3-dioxo-1,3-dihydro-isoindol-2-yl]-2-hydroxy-benzoic acid | CHEMBL175482
TypeSmall organic molecule
Emp. Form.C22H13NO9S
Mol. Mass.467.405
SMILESOC(=O)c1ccc(cc1)S(=O)(=O)c1ccc2C(=O)N(C(=O)c2c1)c1ccc(O)c(c1)C(O)=O