Reaction Details
TargetPhenylethanolamine N-methyltransferase
LigandBDBM13023
Substrate/Competitorn/a
Meas. Tech.ChEMBL_303174 (CHEMBL829668)
Ki 52.0±n/a nM
Citation Grunewald, GLRomero, FACriscione, KR 3-hydroxymethyl-7-(N-substituted aminosulfonyl)-1,2,3,4-tetrahydroisoquinoline inhibitors of phenylethanolamine N-methyltransferase that display remarkable potency and selectivity. J Med Chem48:134-40 (2005) 
 
Phenylethanolamine N-methyltransferase
Name:Phenylethanolamine N-methyltransferase
Type:Enzyme
Mol. Mass.:30852.66
Organism:Homo sapiens (Human)
Description:n/a
Residue:282
BDBM13023
NameBDBM13023
Synonyms:3-(hydroxymethyl)-1,2,3,4-tetrahydroisoquinoline-7-sulfonamide CHEMBL41647
TypeSmall organic molecule
Emp. Form.C10H14N2O3S
Mol. Mass.242.295
SMILESNS(=O)(=O)c1ccc2CC(CO)NCc2c1