Reaction Details
TargetAdenosine receptor A3
LigandBDBM50109481
Substrate/Competitorn/a
Meas. Tech.ChEMBL_302754 (CHEMBL838701)
Ki 0.15±n/a nM
Citation Moro, SBraiuca, PDeflorian, FFerrari, CPastorin, GCacciari, BBaraldi, PGVarani, KBorea, PASpalluto, G Combined target-based and ligand-based drug design approach as a tool to define a novel 3D-pharmacophore model of human A3 adenosine receptor antagonists: pyrazolo[4,3-e]1,2,4-triazolo[1,5-c]pyrimidine derivatives as a key study. J Med Chem48:152-62 (2005) 
 
Adenosine receptor A3
Name:Adenosine receptor A3
Type:G Protein-Coupled Receptor (GPCR)
Mol. Mass.:36197.32
Organism:Homo sapiens (Human)
Description:P0DMS8
Residue:318
BDBM50109481
NameBDBM50109481
Synonyms:1-(2-(furan-2-yl)-8-propyl-8H-pyrazolo[4,3-e][1,2,4]triazolo[1,5-c]pyrimidin-5-yl)-3-phenylurea CHEMBL168018 | MRE 3055F20
TypeSmall organic molecule
Emp. Form.C20H18N8O2
Mol. Mass.402.4093
SMILESCCCn1cc2c(n1)nc(NC(=O)Nc1ccccc1)n1nc(nc21)-c1ccco1