Reaction Details
TargetAdenosine receptor A3
LigandBDBM50051234
Substrate/Competitorn/a
Meas. Tech.ChEMBL_302754 (CHEMBL838701)
Ki 280±n/a nM
Citation Moro, SBraiuca, PDeflorian, FFerrari, CPastorin, GCacciari, BBaraldi, PGVarani, KBorea, PASpalluto, G Combined target-based and ligand-based drug design approach as a tool to define a novel 3D-pharmacophore model of human A3 adenosine receptor antagonists: pyrazolo[4,3-e]1,2,4-triazolo[1,5-c]pyrimidine derivatives as a key study. J Med Chem48:152-62 (2005) 
 
Adenosine receptor A3
Name:Adenosine receptor A3
Type:G Protein-Coupled Receptor (GPCR)
Mol. Mass.:36197.32
Organism:Homo sapiens (Human)
Description:P0DMS8
Residue:318
BDBM50051234
NameBDBM50051234
Synonyms:2-(furan-2-yl)-8-phenethyl-8H-pyrazolo[4,3-e][1,2,4]triazolo[1,5-c]pyrimidin-5-amine CHEMBL16867 | N-[2-Furan-2-yl-8-(3-phenyl-propyl)-2,8-dihydro-3H-pyrazolo[4,3-e][1,2,4]triazolo[1,5-c]pyrimidin-5-yl]-2-phenoxy-acetamide
TypeSmall organic molecule
Emp. Form.C18H15N7O
Mol. Mass.345.358
SMILESNc1nc2nn(CCc3ccccc3)cc2c2nc(nn12)-c1ccco1