Reaction Details
TargetTranslocator protein
LigandBDBM50159085
Substrate/Competitorn/a
Meas. Tech.ChEMBL_303755 (CHEMBL829798)
Ki 0.884±n/a nM
Citation Trapani, GLaquintana, VDenora, NTrapani, ALopedota, ALatrofa, AFranco, MSerra, MPisu, MGFloris, ISanna, EBiggio, GLiso, G Structure-activity relationships and effects on neuroactive steroid synthesis in a series of 2-phenylimidazo[1,2-a]pyridineacetamide peripheral benzodiazepine receptors ligands. J Med Chem48:292-305 (2005) 
 
Translocator protein
Name:Translocator protein
Type:Mitochondrion membrane protein
Mol. Mass.:18945.84
Organism:Rattus norvegicus (rat)
Description:Competitive binding experiments were performed on rat kidney mitochondrial membranes.
Residue:169
BDBM50159085
NameBDBM50159085
Synonyms:CHEMBL359593 | N-Butyl-2-[6-chloro-2-(4-chloro-phenyl)-imidazo[1,2-a]pyridin-3-yl]-N-phenyl-acetamide
TypeSmall organic molecule
Emp. Form.C25H23Cl2N3O
Mol. Mass.452.376
SMILESCCCCN(C(=O)Cc1c(nc2ccc(Cl)cn12)-c1ccc(Cl)cc1)c1ccccc1