Reaction Details
TargetTranslocator protein
LigandBDBM50159097
Substrate/Competitorn/a
Meas. Tech.ChEMBL_303755 (CHEMBL829798)
Ki 2992.208±n/a nM
Citation Trapani, GLaquintana, VDenora, NTrapani, ALopedota, ALatrofa, AFranco, MSerra, MPisu, MGFloris, ISanna, EBiggio, GLiso, G Structure-activity relationships and effects on neuroactive steroid synthesis in a series of 2-phenylimidazo[1,2-a]pyridineacetamide peripheral benzodiazepine receptors ligands. J Med Chem48:292-305 (2005) 
 
Translocator protein
Name:Translocator protein
Type:Mitochondrion membrane protein
Mol. Mass.:18945.84
Organism:Rattus norvegicus (rat)
Description:Competitive binding experiments were performed on rat kidney mitochondrial membranes.
Residue:169
BDBM50159097
NameBDBM50159097
Synonyms:CHEMBL180225 | N-Cyclohexyl-2-[6,8-dichloro-2-(4-chloro-phenyl)-imidazo[1,2-a]pyridin-3-yl]-N-methyl-propionamide
TypeSmall organic molecule
Emp. Form.C23H24Cl3N3O
Mol. Mass.464.815
SMILESCC(C(=O)N(C)C1CCCCC1)c1c(nc2c(Cl)cc(Cl)cn12)-c1ccc(Cl)cc1