Reaction Details
TargetTranslocator protein
LigandBDBM50159098
Substrate/Competitorn/a
Meas. Tech.ChEMBL_303755 (CHEMBL829798)
Ki 1279.258±n/a nM
Citation Trapani, GLaquintana, VDenora, NTrapani, ALopedota, ALatrofa, AFranco, MSerra, MPisu, MGFloris, ISanna, EBiggio, GLiso, G Structure-activity relationships and effects on neuroactive steroid synthesis in a series of 2-phenylimidazo[1,2-a]pyridineacetamide peripheral benzodiazepine receptors ligands. J Med Chem48:292-305 (2005) 
 
Translocator protein
Name:Translocator protein
Type:Mitochondrion membrane protein
Mol. Mass.:18945.84
Organism:Rattus norvegicus (rat)
Description:Competitive binding experiments were performed on rat kidney mitochondrial membranes.
Residue:169
BDBM50159098
NameBDBM50159098
Synonyms:2-(6,8-Dichloro-2-phenyl-imidazo[1,2-a]pyridin-3-yl)-N-methyl-N-(2-pyridin-2-yl-ethyl)-acetamide | CHEMBL179427
TypeSmall organic molecule
Emp. Form.C23H20Cl2N4O
Mol. Mass.439.337
SMILESCN(CCc1ccccn1)C(=O)Cc1c(nc2c(Cl)cc(Cl)cn12)-c1ccccc1