Reaction Details
TargetTranslocator protein
LigandBDBM50159094
Substrate/Competitorn/a
Meas. Tech.ChEMBL_303739 (CHEMBL829782)
Ki 207.468±n/a nM
Citation Trapani, GLaquintana, VDenora, NTrapani, ALopedota, ALatrofa, AFranco, MSerra, MPisu, MGFloris, ISanna, EBiggio, GLiso, G Structure-activity relationships and effects on neuroactive steroid synthesis in a series of 2-phenylimidazo[1,2-a]pyridineacetamide peripheral benzodiazepine receptors ligands. J Med Chem48:292-305 (2005) 
 
Translocator protein
Name:Translocator protein
Type:Mitochondrion membrane protein
Mol. Mass.:18945.84
Organism:Rattus norvegicus (rat)
Description:Competitive binding experiments were performed on rat kidney mitochondrial membranes.
Residue:169
BDBM50159094
NameBDBM50159094
Synonyms:1-{2-[6-Chloro-2-(4-chloro-phenyl)-imidazo[1,2-a]pyridin-3-yl]-acetyl}-piperidine-3-carboxylic acid ethyl ester | CHEMBL179711
TypeSmall organic molecule
Emp. Form.C23H23Cl2N3O3
Mol. Mass.460.353
SMILESCCOC(=O)C1CCCN(C1)C(=O)Cc1c(nc2ccc(Cl)cn12)-c1ccc(Cl)cc1