Reaction Details
TargetSomatostatin receptor type 4
LigandBDBM50159419
Substrate/Competitorn/a
Meas. Tech.ChEMBL_306615 (CHEMBL829075)
IC50 0.5±n/a nM
Citation Erchegyi, JHoeger, CALow, WHoyer, DWaser, BEltschinger, VSchaer, JCCescato, RReubi, JCRivier, JE Somatostatin receptor 1 selective analogues: 2. N(alpha)-Methylated scan. J Med Chem48:507-14 (2005) 
 
Somatostatin receptor type 4
Name:Somatostatin receptor type 4
Type:Enzyme
Mol. Mass.:42015.38
Organism:Homo sapiens (Human)
Description:P31391
Residue:388
BDBM50159419
NameBDBM50159419
Synonyms:CHEMBL262379 | Des-AA1,2,5-[D-Trp8,Tyr11]SRIF
TypeSmall organic molecule
Emp. Form.C67H90N14O16S2
Mol. Mass.1411.646
SMILESC[C@@H](O)[C@H]1NC(=O)[C@H](CCCCN)NC(=O)[C@H](Cc2c[nH]c3ccccc23)NC(=O)[C@H](Cc2ccccc2)NC(=O)[C@@H](Cc2ccccc2)NC(=O)[C@@H](CCCCN)NC(=O)[C@H](N)CSSC[C@H](NC(=O)[C@H](CO)NC(=O)[C@H](NC(=O)[C@H](Cc2ccc(O)cc2)NC1=O)[C@@H](C)O)C(O)=O