Reaction Details
TargetAdenosine receptor A1
LigandBDBM50588447
Substrate/Competitorn/a
Meas. Tech.ChEMBL_2187177 (CHEMBL5099259)
EC50 0.141254±n/a nM
Citation Preti, BSuchankova, ADeganutti, GLeuenberger, MBarkan, KManulak, IHuang, XCarvalho, SLadds, GLochner, M Discovery and Structure-Activity Relationship Studies of Novel Adenosine A J Med Chem65:14864-14890 (2022) 
 
Adenosine receptor A1
Name:Adenosine receptor A1
Type:G Protein-Coupled Receptor (GPCR)
Mol. Mass.:36520.92
Organism:Homo sapiens (Human)
Description:P30542
Residue:326
BDBM50588447
NameBDBM50588447
Synonyms:CHEMBL5172389
TypeSmall organic molecule
Emp. Form.C24H29BrN6O5
Mol. Mass.561.428
SMILESCCNC(=O)[C@H]1O[C@H]([C@H](O)[C@@H]1O)n1cnc2c(N[C@@H]3CCC[C@H]3OCc3cccc(Br)c3)ncnc12