Reaction Details
TargetAdenosine receptor A1
LigandBDBM50588460
Substrate/Competitorn/a
Meas. Tech.ChEMBL_2187177 (CHEMBL5099259)
EC50 0.131826±n/a nM
Citation Preti, BSuchankova, ADeganutti, GLeuenberger, MBarkan, KManulak, IHuang, XCarvalho, SLadds, GLochner, M Discovery and Structure-Activity Relationship Studies of Novel Adenosine A J Med Chem65:14864-14890 (2022) 
 
Adenosine receptor A1
Name:Adenosine receptor A1
Type:G Protein-Coupled Receptor (GPCR)
Mol. Mass.:36520.92
Organism:Homo sapiens (Human)
Description:P30542
Residue:326
BDBM50588460
NameBDBM50588460
Synonyms:CHEMBL5187330
TypeSmall organic molecule
Emp. Form.C24H30N6O6
Mol. Mass.498.5316
SMILESCCNC(=O)[C@H]1O[C@H]([C@H](O)[C@@H]1O)n1cnc2c(N[C@@H]3CCC[C@H]3Oc3cccc(OC)c3)ncnc12