Reaction Details
TargetCarbonic anhydrase 9
LigandBDBM26986
Substrate/Competitorn/a
Meas. Tech.ChEMBL_302624 (CHEMBL838821)
Ki 13000000±n/a nM
Citation Innocenti, AVullo, DScozzafava, ACasey, JRSupuran, C Carbonic anhydrase inhibitors. Interaction of isozymes I, II, IV, V, and IX with carboxylates. Bioorg Med Chem Lett15:573-8 (2005) 
 
Carbonic anhydrase 9
Name:Carbonic anhydrase 9
Type:Enzyme
Mol. Mass.:49669.03
Organism:Homo sapiens (Human)
Description:Catalytic domain of human cloned isozyme was used in the assay
Residue:459
BDBM26986
NameBDBM26986
Synonyms:CHEMBL363707 SODIUM BICARBONATE hydrogen carbonate
TypeIon
Emp. Form.CHO3
Mol. Mass.61.0174
SMILESOC([O-])=O