Reaction Details
TargetCarbonic anhydrase 9
LigandBDBM50159792
Substrate/Competitorn/a
Meas. Tech.ChEMBL_302624 (CHEMBL838821)
Ki 1120000±n/a nM
Citation Innocenti, AVullo, DScozzafava, ACasey, JRSupuran, C Carbonic anhydrase inhibitors. Interaction of isozymes I, II, IV, V, and IX with carboxylates. Bioorg Med Chem Lett15:573-8 (2005) 
 
Carbonic anhydrase 9
Name:Carbonic anhydrase 9
Type:Enzyme
Mol. Mass.:49669.03
Organism:Homo sapiens (Human)
Description:Catalytic domain of human cloned isozyme was used in the assay
Residue:459
BDBM50159792
NameBDBM50159792
Synonyms:CHEMBL181886 Pyruvate sodium 2-oxopropanoate | sodium pyruvate
TypeSmall organic molecule
Emp. Form.C3H3O3
Mol. Mass.87.0547
SMILESCC(=O)C([O-])=O