Reaction Details
TargetCarbonic anhydrase 5A, mitochondrial
LigandBDBM50159792
Substrate/Competitorn/a
Meas. Tech.ChEMBL_302604 (CHEMBL838571)
Ki 5500000±n/a nM
Citation Innocenti, AVullo, DScozzafava, ACasey, JRSupuran, C Carbonic anhydrase inhibitors. Interaction of isozymes I, II, IV, V, and IX with carboxylates. Bioorg Med Chem Lett15:573-8 (2005) 
 
Carbonic anhydrase 5A, mitochondrial
Name:Carbonic anhydrase 5A, mitochondrial
Type:Enzyme
Mol. Mass.:34755.54
Organism:Homo sapiens (Human)
Description:Human (cloned) isozyme
Residue:305
BDBM50159792
NameBDBM50159792
Synonyms:CHEMBL181886 Pyruvate sodium 2-oxopropanoate | sodium pyruvate
TypeSmall organic molecule
Emp. Form.C3H3O3
Mol. Mass.87.0547
SMILESCC(=O)C([O-])=O