Reaction Details
TargetCarbonic anhydrase 2
LigandBDBM26986
Substrate/Competitorn/a
Meas. Tech.ChEMBL_302622 (CHEMBL838819)
Ki 85000000±n/a nM
Citation Innocenti, AVullo, DScozzafava, ACasey, JRSupuran, C Carbonic anhydrase inhibitors. Interaction of isozymes I, II, IV, V, and IX with carboxylates. Bioorg Med Chem Lett15:573-8 (2005) 
 
Carbonic anhydrase 2
Name:Carbonic anhydrase 2
Type:Enzyme
Mol. Mass.:29250.71
Organism:Homo sapiens (Human)
Description:P00918
Residue:260
BDBM26986
NameBDBM26986
Synonyms:CHEMBL363707 SODIUM BICARBONATE hydrogen carbonate
TypeIon
Emp. Form.CHO3
Mol. Mass.61.0174
SMILESOC([O-])=O