Reaction Details
TargetCarbonic anhydrase 2
LigandBDBM50159794
Substrate/Competitorn/a
Meas. Tech.ChEMBL_302622 (CHEMBL838819)
Ki 3220000±n/a nM
Citation Innocenti, AVullo, DScozzafava, ACasey, JRSupuran, C Carbonic anhydrase inhibitors. Interaction of isozymes I, II, IV, V, and IX with carboxylates. Bioorg Med Chem Lett15:573-8 (2005) 
 
Carbonic anhydrase 2
Name:Carbonic anhydrase 2
Type:Enzyme
Mol. Mass.:29250.71
Organism:Homo sapiens (Human)
Description:P00918
Residue:260
BDBM50159794
NameBDBM50159794
Synonyms:CHEMBL1357 Sodium; 2-hydroxy-propionate
TypeSmall organic molecule
Emp. Form.C3H5O3
Mol. Mass.89.0705
SMILESCC(O)C([O-])=O