Reaction Details
TargetCarbonic anhydrase 2
LigandBDBM92494
Substrate/Competitorn/a
Meas. Tech.ChEMBL_302622 (CHEMBL838819)
Ki 2160000±n/a nM
Citation Innocenti, AVullo, DScozzafava, ACasey, JRSupuran, C Carbonic anhydrase inhibitors. Interaction of isozymes I, II, IV, V, and IX with carboxylates. Bioorg Med Chem Lett15:573-8 (2005) 
 
Carbonic anhydrase 2
Name:Carbonic anhydrase 2
Type:Enzyme
Mol. Mass.:29250.71
Organism:Homo sapiens (Human)
Description:P00918
Residue:260
BDBM92494
NameBDBM92494
Synonyms:Citrate | SODIUM CITRATE
TypeSmall organic molecule
Emp. Form.C6H5O7
Mol. Mass.189.1013
SMILESOC(CC([O-])=O)(CC([O-])=O)C([O-])=O