Reaction Details
TargetCarbonic anhydrase 4
LigandBDBM50159794
Substrate/Competitorn/a
Meas. Tech.ChEMBL_302623 (CHEMBL838820)
Ki 1530000±n/a nM
Citation Innocenti, AVullo, DScozzafava, ACasey, JRSupuran, C Carbonic anhydrase inhibitors. Interaction of isozymes I, II, IV, V, and IX with carboxylates. Bioorg Med Chem Lett15:573-8 (2005) 
 
Carbonic anhydrase 4
Name:Carbonic anhydrase 4
Type:Enzyme
Mol. Mass.:35037.98
Organism:Homo sapiens (Human)
Description:P22748
Residue:312
BDBM50159794
NameBDBM50159794
Synonyms:CHEMBL1357 Sodium; 2-hydroxy-propionate
TypeSmall organic molecule
Emp. Form.C3H5O3
Mol. Mass.89.0705
SMILESCC(O)C([O-])=O