Reaction Details
TargetNociceptin receptor
LigandBDBM50159921
Substrate/Competitorn/a
Meas. Tech.ChEMBL_303722 (CHEMBL829057)
Ki 11±n/a nM
Citation Palin, RBarn, DRClark, JKCottney, JECowley, PMCrockatt, MEvans, LFeilden, HGoodwin, RRGriekspoor, FGrove, SJHoughton, AKJones, PSMorphy, RJSmith, ARSundaram, HVrolijk, DWeston, MAWishart, GWren, P Synthesis and SAR studies of 3-phenoxypropyl piperidine analogues as ORL1 (NOP) receptor agonists. Bioorg Med Chem Lett15:589-93 (2005) 
 
Nociceptin receptor
Name:Nociceptin receptor
Type:G Protein-Coupled Receptor (GPCR)
Mol. Mass.:40702.87
Organism:Homo sapiens (Human)
Description:P41146
Residue:370
BDBM50159921
NameBDBM50159921
Synonyms:1-{1-[3-(2,5-Dimethyl-phenoxy)-4-methyl-pentyl]-piperidin-4-yl}-1,3-dihydro-benzoimidazol-2-one | CHEMBL183355
TypeSmall organic molecule
Emp. Form.C26H35N3O2
Mol. Mass.421.575
SMILESCC(C)C(CCN1CCC(CC1)n1c2ccccc2[nH]c1=O)Oc1cc(C)ccc1C