Reaction Details
TargetNociceptin receptor
LigandBDBM50159915
Substrate/Competitorn/a
Meas. Tech.ChEMBL_303722 (CHEMBL829057)
Ki 20±n/a nM
Citation Palin, RBarn, DRClark, JKCottney, JECowley, PMCrockatt, MEvans, LFeilden, HGoodwin, RRGriekspoor, FGrove, SJHoughton, AKJones, PSMorphy, RJSmith, ARSundaram, HVrolijk, DWeston, MAWishart, GWren, P Synthesis and SAR studies of 3-phenoxypropyl piperidine analogues as ORL1 (NOP) receptor agonists. Bioorg Med Chem Lett15:589-93 (2005) 
 
Nociceptin receptor
Name:Nociceptin receptor
Type:G Protein-Coupled Receptor (GPCR)
Mol. Mass.:40702.87
Organism:Homo sapiens (Human)
Description:P41146
Residue:370
BDBM50159915
NameBDBM50159915
Synonyms:1-{1-[3-(2-Chloro-5-methyl-phenoxy)-2-hydroxy-hexyl]-piperidin-4-yl}-1,3-dihydro-benzoimidazol-2-one | CHEMBL182410
TypeSmall organic molecule
Emp. Form.C25H32ClN3O3
Mol. Mass.457.993
SMILESCCCC(Oc1cc(C)ccc1Cl)C(O)CN1CCC(CC1)n1c2ccccc2[nH]c1=O